HUMANITIES-THESAURUS
type: ConceptScheme

Καροποιοί
type: Concept
contributor: Κατσιαδάκη Ελένη (ΑΑ)
contributor: Katsiadakis Helen (AA) @en
created: 2015-10-25
creator: Falierou Anastasia (AA) @la
creator: Φαλιέρου Αναστασία (ΑΑ)
modified: 2018-12-29
source: Δαφέρμος 2007
status: Εκδοθείς
broader: Τεχνίτες
in scheme: HUMANITIES-THESAURUS
notation: 1052
preferred label: Cart manufacturers @en
scope note: Τεχνίτες που ειδικεύονται στην κατασκευή κάρων.
scope note: Craftsmen specialized in the construction of carts. @en

Τεχνίτες
type: Concept
narrower: Καροποιοί
notation: 685
preferred label: Craftsmen @en