HUMANITIES-THESAURUS
type: ConceptScheme

Charcoal makers
type: Concept
contributor: Katsiadakis Helen (AA)
contributor: Κατσιαδάκη Ελένη (ΑΑ) @el
created: 2015-10-29
creator: Falierou Anastasia (AA) @la
creator: Φαλιέρου Αναστασία (ΑΑ) @el
modified: 2018-12-29
source: Δαφέρμος 2007
status: Εκδοθείς
alternative label: Colliers
alternative label: Coal men
broader: Craftsmen
in scheme: HUMANITIES-THESAURUS
notation: 1051
preferred label: Καρβουνιάρηδες @el
scope note: Οι τεχνίτες που κατασκευάζουν και διανέμουν ξυλοκάρβουνα. @el
scope note: Craftsmen who manufacture and distribute charcoal.

Craftsmen
type: Concept
narrower: Charcoal makers
notation: 685
preferred label: Τεχνίτες @el