HUMANITIES-THESAURUS
type: ConceptScheme

Έμφυλη ταυτότητα
type: Concept
contributor: Κατσιαδάκη Ελένη (ΑΑ)
contributor: Katsiadakis Helen (AA) @en
created: 2015-01-26
creator: Souyioultzoglou Iraklitos (AA) @fr
creator: Σουγιουλτζόγλου Ηράκλειτος (ΑΑ)
modified: 2020-08-26
source: Kimmel & Aronson 2013
status: Εκδοθείς
broader: Κοινωνική ταυτότητα
in scheme: HUMANITIES-THESAURUS
notation: 1047
preferred label: Gender identity @en
related: Έμφυλες ομάδες
scope note: Έκφανση της κοινωνικής ταυτότητας που αναφέρεται στα στερεοτυπικά χαρακτηριστικά και τους ρόλους των φορέων της, σύμφωνα με τα ισχύοντα κοινωνικά και πολιτισμικά πρότυπα σχετικά με το βιολογικό τους φύλο.
scope note: Aspect of social identity, which refers to a person's assumed characteristics and roles, as designated by the prevailing social and cultural stereotypes about their sex. @en

Έμφυλες ομάδες
type: Concept
notation: 2042
preferred label: Gender groups @en
related: Έμφυλη ταυτότητα

Κοινωνική ταυτότητα
type: Concept
narrower: Έμφυλη ταυτότητα
notation: 457
preferred label: Social identity @en