HUMANITIES-THESAURUS
type: ConceptScheme

Χανιτζήδες
type: Concept
contributor: Φαλιέρου Αναστασία (ΑΑ)
contributor: Falierou Anastasia (AA) @fr
created: 2015-10-25
creator: Φαλιέρου Αναστασία (ΑΑ)
creator: Falierou Anastasia (AA) @la
modified: 2020-10-20
source: Δαφέρμος 2007
status: Εκδοθείς
alternative label: Πανδοχείς
broader: Ιστορικές επαγγελματικές ομάδες
in scheme: HUMANITIES-THESAURUS
notation: 1038
preferred label: Innkeepers @en
scope note: Οι ιδιοκτήτες ενός χανιού. Στα χάνια ξεκουράζονταν και διανυκτέρευαν οι οδοιπόροι. Η αμοιβή των χανιτζήδων περιελάμβανε το φαγητό, τον ύπνο, το τάισμα των ζώων και οτιδήποτε άλλο χρεωνόταν ο περαστικός. Επίσης, οι χανιτζήδες προσέφεραν στους ταξιδιώτες πληροφορίες για τη συνέχεια του ταξιδιού τους.
scope note: The owners of an inn called hani, in which travellers could rest overnight. The innkeepers charged travellers for food, accommodation, feeding their animals, and any other needs. Innkeepers also provided travellers with information on their journey’s route. @en

Ιστορικές επαγγελματικές ομάδες
type: Concept
narrower: Χανιτζήδες
notation: 2636
preferred label: Historical occupational groups @en