HUMANITIES-THESAURUS
type: ConceptScheme

Πολυγαμία
type: Concept
contributor: Κατσιαδάκη Ελένη (ΑΑ)
contributor: Katsiadakis Helen (AA) @en
created: 2015-05-12
creator: Σουγιουλτζόγλου Ηράκλειτος (ΑΑ)
creator: Souyioultzoglou Iraklitos (AA) @de
modified: 2020-08-26
source: Stone 2013
status: Εκδοθείς
broader: Προτασιακά αντικείμενα
in scheme: HUMANITIES-THESAURUS
notation: 103
preferred label: Polygamy @en
scope note: The socially accepted condition of a person being engaged in marriage with two, or more, partners. In such instances, a man may have multiple wives (polygyny), or vice versa (polyandry). @en
scope note: Η κοινωνικά αποδεκτή σύναψη γάμων μεταξύ περισσότερων των δύο συζύγων. Στις περιπτώσεις πολυγαμίας, ένας άνδρας μπορεί να έχει πολλές συζύγους (πολυγυνία), ή το αντίθετο (πολυανδρία).

Προτασιακά αντικείμενα
type: Concept
narrower: Πολυγαμία
notation: 25
preferred label: Propositional objects @en