HUMANITIES-THESAURUS
type: ConceptScheme

Κετσετζήδες
type: Concept
contributor: Κατσιαδάκη Ελένη (ΑΑ)
contributor: Katsiadakis Helen (AA) @en
created: 2015-10-29
creator: Φαλιέρου Αναστασία (ΑΑ)
creator: Falierou Anastasia (AA) @la
modified: 2018-12-29
source: Δαφέρμος 2007
status: Εκδοθείς
broader: Τεχνίτες
in scheme: HUMANITIES-THESAURUS
notation: 1012
preferred label: Feltmakers @en
scope note: Οι τεχνίτες που ασχολούνταν με την κατασκευή του κετσέ, δηλαδή του συμπιεσμένου μαλλιού προβάτου, το οποίο χρησιμοποιούνταν στο εσωτερικό του σαμαριού.

Τεχνίτες
type: Concept
narrower: Κετσετζήδες
notation: 685
preferred label: Craftsmen @en